{"text_format":"1","workbook":"xlsx","n_sheets":5,"sheets":["Endring nr. 1","Endring nr. 2","Endring nr. 3","Endring nr. 4","Ark4"],"not_rendered":{"charts":0,"images":1,"macros":0,"external_links":1,"defined_names":5,"comments":0,"pivot_tables":0},"unopened":[],"bounds":{"document_bytes":16777216,"sheet_cells":100000,"rows_first":2000,"rows_last":500,"rows_between":2000,"halvings":0,"cell_chars":16384,"cell_head_chars":4096},"cells_cut":0,"cells_raw":0,"read":"whole","date_system":"1900"}

{"sheet":"Endring nr. 1","index":0,"n_rows":47,"n_cols":9,"rows_kept":47,"cut":false,"hidden":false,"merged":[[8,1,8,8],[23,6,23,8],[19,3,19,5],[20,3,20,5],[21,3,21,5],[14,2,14,3],[15,3,15,7],[16,2,16,3],[22,3,22,5],[19,6,19,8],[17,2,17,3],[18,2,18,3],[20,6,20,8],[21,6,21,8],[46,1,46,8],[39,2,39,4],[39,6,39,8],[40,1,40,8],[41,2,41,8],[43,5,43,6],[3,2,3,6],[24,3,24,5],[25,3,25,5],[26,3,26,5],[27,3,27,5],[29,6,29,8],[22,6,22,8],[29,3,29,5],[23,3,23,5],[10,3,10,5],[12,1,12,8],[13,3,13,4],[13,6,13,8],[37,3,37,5],[4,6,4,8],[30,6,30,8],[7,1,7,8],[37,6,37,8],[32,6,32,8],[38,3,38,5],[26,6,26,8],[25,6,25,8],[24,6,24,8],[27,6,27,8],[28,6,28,8],[38,6,38,8],[31,6,31,8],[28,3,28,5]]}
[]
[]
[null,null,"Forhandler"]
[null,null,"Viggabygg A/S",null,null,null,null,null,"Endringsmelding nr. 1"]
[null,null,null,null," "," "]
[null,null,"Att:",null,null,null,"Bestilling datert:"]
[]
[null," "]
[]
[null,null,"Arkivnr.:",null,"Tegn.","1:100","datert:"]
[null," ","Kundenavn:",null,null,null,"Tlf:"]
[null,null,"Adresse:",null,"Postnr.:"," ","Sted:"]
[]
[null,null,"Prosjekt:",null,null,"Adresse:"]
[null," "," ",null," "," "," ",null," "]
[null,null,"Registrert i:","  Hovedkontrakt              Endringskontrakt                       Annet         :"]
[null,null," "]
[null,null," "]
[null,null," "]
[null,null,"Post","Spesifikasjon av endringen",null,null,"Ev. kommentarer fra Konsmo Fab."]
[null,null," "]
[null,null," "]
[null,null," "]
[null,null," "]
[]
[]
[]
[]
[]
[null,null," "]
[]
[]
[]
[]
[]
[]
[]
[null,null," "]
[null,null," "]
[null,null," "]
[null," "]
[null,null,"Endringer skal sendes skriftlig til Konsmo Fabrikker AS  "]
[]
[null,null,"Sted:","dato","For  ",{"$f":"IF(C4=0,\"\",C4)","v":"Viggabygg A/S"}]
[null,null,null,null,null,null,null,null,"Byggeleder"]
[]
[null,"KONSMO FABRIKKER AS,   4525    KONSMO  *  Tlf: 3828 1322  *  Fax:  3828 1860  *  E-post: firmapost@konsmohus.no  *  www.konsmohus.no"]

{"sheet":"Endring nr. 2","index":1,"n_rows":47,"n_cols":9,"rows_kept":47,"cut":false,"hidden":false,"merged":[[40,1,40,8],[41,2,41,8],[43,5,43,6],[46,1,46,8],[32,6,32,8],[37,3,37,5],[37,6,37,8],[38,3,38,5],[38,6,38,8],[39,2,39,4],[39,6,39,8],[28,3,28,5],[28,6,28,8],[29,3,29,5],[29,6,29,8],[30,6,30,8],[31,6,31,8],[25,3,25,5],[25,6,25,8],[26,3,26,5],[26,6,26,8],[27,3,27,5],[27,6,27,8],[22,3,22,5],[22,6,22,8],[23,3,23,5],[23,6,23,8],[24,3,24,5],[24,6,24,8],[18,2,18,3],[19,3,19,5],[19,6,19,8],[20,3,20,5],[20,6,20,8],[21,3,21,5],[21,6,21,8],[13,3,13,4],[13,6,13,8],[14,2,14,3],[15,3,15,7],[16,2,16,3],[17,2,17,3],[3,2,3,6],[4,6,4,8],[7,1,7,8],[8,1,8,8],[10,3,10,5],[12,1,12,8]]}
[]
[]
[null,null,"Forhandler"]
[null,null,{"$f":"'Endring nr. 1'!C4:G4","v":"Viggabygg A/S"},null,null,null,null,null,"Endringsmelding nr. 2"]
[null,null,null,null," "," "]
[null,null,"Att:",null,null,null,"Bestilling datert:"]
[]
[null," "]
[]
[null,null,"Arkivnr.:",null,"Tegn.","1:100","datert:"]
[null," ","Kundenavn:",null,null,null,"Tlf:"]
[null,null,"Adresse:",null,"Postnr.:"," ","Sted:"]
[]
[null,null,"Prosjekt:",null,null,"Adresse:"]
[null," "," ",null," "," "," ",null," "]
[null,null,"Registrert i:","  Hovedkontrakt              Endringskontrakt                       Annet         :"]
[null,null," "]
[null,null," "]
[null,null," "]
[null,null,"Post","Spesifikasjon av endringen",null,null,"Ev. kommentarer fra Konsmo Fab."]
[null,null," "]
[null,null," "]
[null,null," "]
[null,null," "]
[]
[]
[]
[]
[]
[null,null," "]
[]
[]
[]
[]
[]
[]
[]
[null,null," "]
[null,null," "]
[null,null," "]
[null," "]
[null,null,"Endringer skal sendes skriftlig til Konsmo Fabrikker AS  "]
[]
[null,null,"Sted:","dato","For  ",{"$f":"IF(C4=0,\"\",C4)","v":"Viggabygg A/S"}]
[null,null,null,null,null,null,null,null,"Byggeleder"]
[]
[null,"KONSMO FABRIKKER AS,   4525    KONSMO  *  Tlf: 3828 1322  *  Fax:  3828 1860  *  E-post: firmapost@konsmohus.no  *  www.konsmohus.no"]

{"sheet":"Endring nr. 3","index":2,"n_rows":47,"n_cols":9,"rows_kept":47,"cut":false,"hidden":false,"merged":[[40,1,40,8],[41,2,41,8],[43,5,43,6],[46,1,46,8],[32,6,32,8],[37,3,37,5],[37,6,37,8],[38,3,38,5],[38,6,38,8],[39,2,39,4],[39,6,39,8],[28,3,28,5],[28,6,28,8],[29,3,29,5],[29,6,29,8],[30,6,30,8],[31,6,31,8],[25,3,25,5],[25,6,25,8],[26,3,26,5],[26,6,26,8],[27,3,27,5],[27,6,27,8],[22,3,22,5],[22,6,22,8],[23,3,23,5],[23,6,23,8],[24,3,24,5],[24,6,24,8],[18,2,18,3],[19,3,19,5],[19,6,19,8],[20,3,20,5],[20,6,20,8],[21,3,21,5],[21,6,21,8],[13,3,13,4],[13,6,13,8],[14,2,14,3],[15,3,15,7],[16,2,16,3],[17,2,17,3],[3,2,3,6],[4,6,4,8],[7,1,7,8],[8,1,8,8],[10,3,10,5],[12,1,12,8]]}
[]
[]
[null,null,"Forhandler"]
[null,null,{"$f":"'Endring nr. 1'!C4:G4","v":"Viggabygg A/S"},null,null,null,null,null,"Endringsmelding nr. 3"]
[null,null,null,null," "," "]
[null,null,"Att:",null,null,null,"Bestilling datert:"]
[]
[null," "]
[]
[null,null,"Arkivnr.:",null,"Tegn.","1:100","datert:"]
[null," ","Kundenavn:",null,null,null,"Tlf:"]
[null,null,"Adresse:",null,"Postnr.:"," ","Sted:"]
[]
[null,null,"Prosjekt:",null,null,"Adresse:"]
[null," "," ",null," "," "," ",null," "]
[null,null,"Registrert i:","  Hovedkontrakt              Endringskontrakt                       Annet         :"]
[null,null," "]
[null,null," "]
[null,null," "]
[null,null,"Post","Spesifikasjon av endringen",null,null,"Ev. kommentarer fra Konsmo Fab."]
[null,null," "]
[null,null," "]
[null,null," "]
[null,null," "]
[]
[]
[]
[]
[]
[null,null," "]
[]
[]
[]
[]
[]
[]
[]
[null,null," "]
[null,null," "]
[null,null," "]
[null," "]
[null,null,"Endringer skal sendes skriftlig til Konsmo Fabrikker AS  "]
[]
[null,null,"Sted:","dato","For  ",{"$f":"IF(C4=0,\"\",C4)","v":"Viggabygg A/S"}]
[null,null,null,null,null,null,null,null,"Byggeleder"]
[]
[null,"KONSMO FABRIKKER AS,   4525    KONSMO  *  Tlf: 3828 1322  *  Fax:  3828 1860  *  E-post: firmapost@konsmohus.no  *  www.konsmohus.no"]

{"sheet":"Endring nr. 4","index":3,"n_rows":47,"n_cols":9,"rows_kept":47,"cut":false,"hidden":false,"merged":[[40,1,40,8],[41,2,41,8],[43,5,43,6],[46,1,46,8],[32,6,32,8],[37,3,37,5],[37,6,37,8],[38,3,38,5],[38,6,38,8],[39,2,39,4],[39,6,39,8],[28,3,28,5],[28,6,28,8],[29,3,29,5],[29,6,29,8],[30,6,30,8],[31,6,31,8],[25,3,25,5],[25,6,25,8],[26,3,26,5],[26,6,26,8],[27,3,27,5],[27,6,27,8],[22,3,22,5],[22,6,22,8],[23,3,23,5],[23,6,23,8],[24,3,24,5],[24,6,24,8],[18,2,18,3],[19,3,19,5],[19,6,19,8],[20,3,20,5],[20,6,20,8],[21,3,21,5],[21,6,21,8],[13,3,13,4],[13,6,13,8],[14,2,14,3],[15,3,15,7],[16,2,16,3],[17,2,17,3],[3,2,3,6],[4,6,4,8],[7,1,7,8],[8,1,8,8],[10,3,10,5],[12,1,12,8]]}
[]
[]
[null,null,"Forhandler"]
[null,null,{"$f":"'Endring nr. 1'!C4:G4","v":"Viggabygg A/S"},null,null,null,null,null,"Endringsmelding nr. 4"]
[null,null,null,null," "," "]
[null,null,"Att:",null,null,null,"Bestilling datert:"]
[]
[null," "]
[]
[null,null,"Arkivnr.:",null,"Tegn.","1:100","datert:"]
[null," ","Kundenavn:",null,null,null,"Tlf:"]
[null,null,"Adresse:",null,"Postnr.:"," ","Sted:"]
[]
[null,null,"Prosjekt:",null,null,"Adresse:"]
[null," "," ",null," "," "," ",null," "]
[null,null,"Registrert i:","  Hovedkontrakt              Endringskontrakt                       Annet         :"]
[null,null," "]
[null,null," "]
[null,null," "]
[null,null,"Post","Spesifikasjon av endringen",null,null,"Ev. kommentarer fra Konsmo Fab."]
[null,null," "]
[null,null," "]
[null,null," "]
[null,null," "]
[]
[]
[]
[]
[]
[null,null," "]
[]
[]
[]
[]
[]
[]
[]
[null,null," "]
[null,null," "]
[null,null," "]
[null," "]
[null,null,"Endringer skal sendes skriftlig til Konsmo Fabrikker AS  "]
[]
[null,null,"Sted:","dato","For  ",{"$f":"IF(C4=0,\"\",C4)","v":"Viggabygg A/S"}]
[null,null,null,null,null,null,null,null,"Byggeleder"]
[]
[null,"KONSMO FABRIKKER AS,   4525    KONSMO  *  Tlf: 3828 1322  *  Fax:  3828 1860  *  E-post: firmapost@konsmohus.no  *  www.konsmohus.no"]

{"sheet":"Ark4","index":4,"n_rows":22,"n_cols":2,"rows_kept":22,"cut":false,"hidden":true,"merged":[]}
[]
[]
[]
[]
[]
[null,{"$f":"IF([1]Base!B72=0,\"\",[1]Base!B72)","v":"Viggabygg A/S"}]
[null,{"$f":"IF([1]Base!B73=0,\"\",[1]Base!B73)","v":"Asker & Bærum Hus A/S"}]
[null,{"$f":"IF([1]Base!B74=0,\"\",[1]Base!B74)","v":"WaxHus A/S"}]
[null,{"$f":"IF([1]Base!B75=0,\"\",[1]Base!B75)","v":"Hus & Eiendom A/S"}]
[null,{"$f":"IF([1]Base!B76=0,\"\",[1]Base!B76)","v":"Byggmester Olaf Haugland"}]
[null,{"$f":"IF([1]Base!B77=0,\"\",[1]Base!B77)","v":""}]
[null,{"$f":"IF([1]Base!B78=0,\"\",[1]Base!B78)","v":""}]
[null,{"$f":"IF([1]Base!B79=0,\"\",[1]Base!B79)","v":""}]
[null,{"$f":"IF([1]Base!B80=0,\"\",[1]Base!B80)","v":""}]
[null,{"$f":"IF([1]Base!B81=0,\"\",[1]Base!B81)","v":""}]
[null,{"$f":"IF([1]Base!B82=0,\"\",[1]Base!B82)","v":""}]
[null,{"$f":"IF([1]Base!B83=0,\"\",[1]Base!B83)","v":""}]
[null,{"$f":"IF([1]Base!B84=0,\"\",[1]Base!B84)","v":""}]
[null,{"$f":"IF([1]Base!B85=0,\"\",[1]Base!B85)","v":""}]
[null,{"$f":"IF([1]Base!B86=0,\"\",[1]Base!B86)","v":""}]
[null,{"$f":"IF([1]Base!B87=0,\"\",[1]Base!B87)","v":""}]
[null,{"$f":"IF([1]Base!B88=0,\"\",[1]Base!B88)","v":""}]